{"text_format":"1","workbook":"xlsx","n_sheets":6,"sheets":["Eingabemaske","Stückliste","Kurzanleitung","Gesamtpreisliste","Ausschreibungstexte","Changelog"],"not_rendered":{"charts":0,"images":5,"macros":1,"external_links":0,"defined_names":9,"comments":1,"pivot_tables":0},"unopened":[],"bounds":{"document_bytes":16777216,"sheet_cells":100000,"rows_first":2000,"rows_last":500,"rows_between":2000,"halvings":0,"cell_chars":16384,"cell_head_chars":4096},"cells_cut":0,"cells_raw":0,"read":"whole","date_system":"1900"}

{"sheet":"Eingabemaske","index":0,"n_rows":139,"n_cols":15,"rows_kept":139,"cut":false,"hidden":false,"merged":[[0,1,1,1],[139,3,139,4],[139,11,139,12]]}
[null,"\n  Eltako Professional Smart Home 2024 \n   Geräteermittlung und Kalkulationshilfe (Stand 10.07.2024)\n   Preise gültig für Lieferungen ab 01.01.2024"]
[]
["A","Ermittlung der gewünschten Funktionen bzw. Verbraucher",null,"Eingabehilfe","Eingabe",null,null,null,null,null,null,"Eingabehilfe","Eingabe"]
[1,"Soll das System grundsätzlich funkfähig sein?",null,"ja/nein","Ja",null,null,null,null,null,null,"ja/nein","Ja"]
[2,"Sind Sensoren für den 4-Draht Bussystem gewünscht?",null,"ja/nein","Auswählen",null,null,null,null,null,null,"ja/nein","Auswählen"]
[3,"Sind Funktionen mit Powerline gewünscht?",null,"ja/nein","Auswählen",null,null,null,null,null,null,"ja/nein","Auswählen"]
[4,"Welches Schalterprogramm wird geplant?",null,"Größe/Farbe","Auswählen",null,null,null,null,null,null,"Größe/Farbe","Auswählen"]
[5,"Wieviele weitere UV´s werden am Bus angebunden?",null,"Zahl",0,null,null,null,null,null,null,"Zahl",0]
[6,"Sollen geräuschlose Halbleiter-Schaltaktoren bevorzugt werden?",null,"ja/nein","Auswählen",null,null,null,null,null,null,"ja/nein","Auswählen"]
[7,"Dimmkreise 400W (bei LED max. 100W oder max. 8 Leuchtmittel) REG",null,"Zahl",0,null,null,null,null,null,null,"Zahl",0]
[8,"Dimmkreise 800W (bei LED max. 200W oder max. 16 Leuchtmittel) REG",null,"Zahl",0,null,null,null,null,null,null,"Zahl",0]
[9,"Dimmkreise 1-10V REG",null,"Zahl",0,null,null,null,null,null,null,"Zahl",0]
[10,"DALI-Kreise (max 16 Gruppen mit 64 Tln. in einer Linie möglich) REG",null,"Zahl",0,null,null,null,null,null,null,"Zahl",0]
[11,"RGBW Farbsteuerung PWM-Dimmschalter (4A pro Kanal) REG",null,"Zahl",0,null,null,null,null,null,null,"Zahl",0]
[12,"Schaltkreise bis 8A speziell für LED-Beleuchtung bis 400W REG",null,"Zahl",0,null,null,null,null,null,null,"Zahl",0]
[13,"Schalt- und Stromkreise bis 16 A REG",null,"Zahl",0,null,null,null,null,null,null,"Zahl",0]
[14,"Motoren (Rollo, Jalousie, Markise) REG",null,"Zahl",0,null,null,null,null,null,null,"Zahl",0]
["B","Einzelraumregelung Fußbodenheizung über Heizkreisverteiler",null,"ja/nein","Auswählen",null,null,null,null,null,null,"ja/nein","Auswählen"]
[15,"Funk-Temperaturregelung mit Display (rückmeldefähig)",null,"Zahl",0,null,null,null,null,null,null,"Zahl",0]
[16,"Funk-Temperaturregelung mit Display und Schaltkontakt  (rückmeldefähig)",null,"Zahl",0,null,null,null,null,null,null,"Zahl",0]
{"$rows_left_out":120}
{"sheet":"Stückliste","index":1,"n_rows":186,"n_cols":28,"rows_kept":186,"cut":false,"hidden":false,"merged":[[184,1,184,3],[1,14,1,18],[0,3,0,4]]}
[null,"  \n  Eltako Professional Smart Home 2024\n  Stückliste und Preisliste (gültig für Lieferungen ab 01.01.2024)",null,"alle Angaben\nsind unverbindlich\nund ohne Gewähr",null,null,null,null,null,null,null,"alle Angaben\nsind unverbindlich\nund ohne Gewähr"]
[null,"Artikelbezeichnung",null,"Menge","Teilungs-\neinheiten","Brutto EP","Brutto Wert",null,"Leistungsbedarf","Gesamt",null,"Menge","Teilungs-\neinheiten",null,"Prüfung: Preise, EAN und Bestellnr.",null,null,null,null,null,null,null,null,null,null,null,"Art-Nr.","EAN Nummer"]
[]
[101,"BBV14 flexible Busverbinder (altern. auch FBA14  möglich)",{"$f":"IF(SUM(E5:E124)<13,0,(SUM(E5:E50,E121:E122)-1)/12)","v":0},{"$f":"ROUNDDOWN(C4,0)","v":0},{"$f":"D4","v":0},24.3,{"$f":"D4*F4","v":0},null,null,null,{"$f":"IF(D4>0,D4,\"\")","v":""},{"$f":"ROUNDDOWN(K4,0)","v":{"$error":"#VALUE!"}},{"$f":"L4","v":{"$error":"#VALUE!"}},null,{"$f":"VLOOKUP(AB4,Gesamtpreisliste!$A$7:$E$888,2,FALSE)","v":30014053},{"$f":"EXACT(O4,AA4)","v":true},{"$f":"VLOOKUP(AB4,Gesamtpreisliste!$A$7:$E$888,3,FALSE)","v":"BBV14"},{"$f":"VLOOKUP(AB4,Gesamtpreisliste!$A$7:$E$888,5,FALSE)","v":24.3},{"$f":"EXACT(F4,R4)","v":true},null,null,null,null,null,null,null,30014053,4010312315248]
[102,"FBA14 Busankoppler (bitte bei Bedarf manuell eintragen)",{"$f":"2*Eingabemaske!E8+(IF(AND(OR(Eingabemaske!E81>0,Eingabemaske!E82>0),Eingabemaske!E8=0),1,0))","v":0},{"$f":"C5","v":0},0,33.4,0,null,null,null,{"$f":"IF(D5>0,D5,\"\")","v":""},{"$f":"K5","v":""},"",null,{"$f":"VLOOKUP(AB5,Gesamtpreisliste!$A$7:$E$888,2,FALSE)","v":30014018},{"$f":"EXACT(O5,AA5)","v":true},{"$f":"VLOOKUP(AB5,Gesamtpreisliste!$A$7:$E$888,3,FALSE)","v":"FBA14"},{"$f":"VLOOKUP(AB5,Gesamtpreisliste!$A$7:$E$888,5,FALSE)","v":33.4},{"$f":"EXACT(F5,R5)","v":true},null,null,null,null,null,null,null,30014018,4010312313862]
[103,"WNT61-24VDC/10W Schaltnetzteil (für FWS61 oder FUTH55ED 12-24V)",{"$f":"C56","v":0},{"$f":"C6","v":0},0,47.2,0,null,null,null,"",{"$f":"K6","v":""},"",null,{"$f":"VLOOKUP(AB6,Gesamtpreisliste!$A$7:$E$888,2,FALSE)","v":61000264},true,{"$f":"VLOOKUP(AB6,Gesamtpreisliste!$A$7:$E$888,3,FALSE)","v":"WNT61-12VDC/10W"},{"$f":"VLOOKUP(AB6,Gesamtpreisliste!$A$7:$E$888,5,FALSE)","v":47.2},true,null,null,null,null,null,null,null,61000264,4010312401934]
[104,"WNT61-12VDC/10W Schaltnetzteil (für UP-Sensoren 12-24V)",null,0,0,47.2,0,null,null,null,"","","",null,{"$f":"VLOOKUP(AB7,Gesamtpreisliste!$A$7:$E$888,2,FALSE)","v":61000265},true,{"$f":"VLOOKUP(AB7,Gesamtpreisliste!$A$7:$E$888,3,FALSE)","v":"WNT61-24VDC/10W"},{"$f":"VLOOKUP(AB7,Gesamtpreisliste!$A$7:$E$888,5,FALSE)","v":47.2},true,null,null,null,null,null,null,null,61000265,4010312401941]
[105,"FSNT14-12V/12W Schaltnetzteil (Leistungserw.)",{"$f":"IF(SUM(J9:J184)>41,4,IF(SUM(J9:J184)>29,3,IF(SUM(J9:J184)>17,2,IF(SUM(J9:J184)>5,1,0))))","v":0},0,0,55.6,0,null,null,null,"","","",null,{"$f":"VLOOKUP(AB8,Gesamtpreisliste!$A$7:$E$888,2,FALSE)","v":30014062},true,{"$f":"VLOOKUP(AB8,Gesamtpreisliste!$A$7:$E$888,3,FALSE)","v":"FSNT14-12V/12W"},{"$f":"VLOOKUP(AB8,Gesamtpreisliste!$A$7:$E$888,5,FALSE)","v":55.6},true,null,null,null,null,null,null,null,30014062,4010312315095]
[106,"FGW14 Gateway",{"$f":"IF(Eingabemaske!E87>0,1,0)","v":0},0,0,68.5,0,null,0.5,{"$f":"D9*I9","v":0},"","","",null,{"$f":"VLOOKUP(AB9,Gesamtpreisliste!$A$7:$E$888,2,FALSE)","v":30014017},true,{"$f":"VLOOKUP(AB9,Gesamtpreisliste!$A$7:$E$888,3,FALSE)","v":"FGW14"},{"$f":"VLOOKUP(AB9,Gesamtpreisliste!$A$7:$E$888,5,FALSE)","v":68.5},true,null,null,null,null,null,null,null,30014017,4010312313855]
[107,"FGW14-USB Gateway mit USB-Anbindung für  Serveranbindung",null,0,0,64.900000000000006,0,null,0.5,0,"","","",null,{"$f":"VLOOKUP(AB10,Gesamtpreisliste!$A$7:$E$888,2,FALSE)","v":30014049},true,{"$f":"VLOOKUP(AB10,Gesamtpreisliste!$A$7:$E$888,3,FALSE)","v":"FGW14-USB"},{"$f":"VLOOKUP(AB10,Gesamtpreisliste!$A$7:$E$888,5,FALSE)","v":64.900000000000006},true,null,null,null,null,null,null,null,30014049,4010312316054]
[108,"BGW14 Busgateway für Raumtemperaturregler",{"$f":"IF(OR(AND(Eingabemaske!E5=\"ja\",Eingabemaske!E18=\"ja\"),AND(Eingabemaske!E5=\"ja\",Eingabemaske!E64=\"ja\")),SUM((Eingabemaske!E23+Eingabemaske!E24+Eingabemaske!E25+Eingabemaske!E66)/16),0)","v":0},{"$f":"ROUNDUP(C11,0)","v":0},0,64.900000000000006,0,null,0.3,0,"",{"$f":"ROUNDUP(K11,0)","v":{"$error":"#VALUE!"}},{"$error":"#VALUE!"},null,{"$f":"VLOOKUP(AB11,Gesamtpreisliste!$A$7:$E$888,2,FALSE)","v":30014046},true,{"$f":"VLOOKUP(AB11,Gesamtpreisliste!$A$7:$E$888,3,FALSE)","v":"BGW14"},{"$f":"VLOOKUP(AB11,Gesamtpreisliste!$A$7:$E$888,5,FALSE)","v":64.900000000000006},true,null,null,null,null,null,null,null,30014046,4010312319062]
[109,"FTD14 Telegrammduplizierer zur Wetterdatenübertragung an die GFVS",{"$f":"IF(OR(AND(Eingabemaske!E49=\"ja\",Eingabemaske!E50=\"Multi\",Eingabemaske!E52=\"Draht\",Eingabemaske!E126=\"ja\",C13>0),AND(Eingabemaske!E5=\"ja\",C13>0)),1,0)","v":0},{"$f":"C12","v":0},0,92.6,0,null,0.53,0,"",{"$f":"K12","v":""},"",null,{"$f":"VLOOKUP(AB12,Gesamtpreisliste!$A$7:$E$888,2,FALSE)","v":30014057},true,{"$f":"VLOOKUP(AB12,Gesamtpreisliste!$A$7:$E$888,3,FALSE)","v":"FTD14"},{"$f":"VLOOKUP(AB12,Gesamtpreisliste!$A$7:$E$888,5,FALSE)","v":92.6},true,null,null,null,null,null,null,null,30014057,4010312315705]
[110,"\"Zwischenrechnung Merker \"",{"$f":"IF(OR(Eingabemaske!E130>0,Eingabemaske!E131>0,AND(Eingabemaske!E127>0,NOT(Eingabemaske!E132=\"ja\")),AND(Eingabemaske!E129>0,NOT(Eingabemaske!E132=\"ja\"))),1,0)","v":0},0,0,{"$error":"#N/A"},0,null,null,null,"",0,0,null,{"$f":"VLOOKUP(AB13,Gesamtpreisliste!$A$7:$E$888,2,FALSE)","v":{"$error":"#N/A"}},{"$error":"#N/A"},{"$f":"VLOOKUP(AB13,Gesamtpreisliste!$A$7:$E$888,3,FALSE)","v":{"$error":"#N/A"}},{"$f":"VLOOKUP(AB13,Gesamtpreisliste!$A$7:$E$888,5,FALSE)","v":{"$error":"#N/A"}}]
[111,"USB-Kabel 2m für FGW14-USB Typ A St/Bu",{"$f":"IF(Eingabemaske!E132=\"ja\",1,0)","v":0},{"$f":"C14","v":0},null,15.9,{"$f":"D14*F14","v":0},null,null,null,"",{"$f":"K14","v":""},null,null,{"$f":"VLOOKUP(AB14,Gesamtpreisliste!$A$7:$E$888,2,FALSE)","v":30000020},true,{"$f":"VLOOKUP(AB14,Gesamtpreisliste!$A$7:$E$888,3,FALSE)","v":"USB-Verlängerungskabel"},{"$f":"VLOOKUP(AB14,Gesamtpreisliste!$A$7:$E$888,5,FALSE)","v":15.9},true,null,null,null,null,null,null,null,30000020,4010312907702]
[112,"FAM14 Funk-Antennenmodul",{"$f":"IF(AND(Eingabemaske!E4=\"ja\")*OR(C20>0,Eingabemaske!E10>0,Eingabemaske!E11>0,Eingabemaske!E12>0,Eingabemaske!E13>0,Eingabemaske!E15>0,Eingabemaske!E16>0,Eingabemaske!E17>0,Eingabemaske!E19>0,Eingabemaske!E20>0,Eingabemaske!E21>0,Eingabemaske!E22>0,Eingabemaske!E23>0,Eingabemaske!E24>0,Eingabemaske!E25>0,Eingabemaske!E26>0,AND(Eingabemaske!E49=\"ja\",NOT(Eingabemaske!E50=\"keine\")),Eingabemaske!E77>0,Eingabemaske!E78>0,Eingabemaske!E79>0,Eingabemaske!E80>0,Eingabemaske!E81>0,Eingabemaske!E82>0,Eingabemaske!E84>0),1,0)","v":0},0,{"$f":"D15*2","v":0},123.4,0,null,1,null,"","",{"$f":"L15*2","v":{"$error":"#VALUE!"}},null,{"$f":"VLOOKUP(AB15,Gesamtpreisliste!$A$7:$E$888,2,FALSE)","v":30014000},true,{"$f":"VLOOKUP(AB15,Gesamtpreisliste!$A$7:$E$888,3,FALSE)","v":"FAM14"},{"$f":"VLOOKUP(AB15,Gesamtpreisliste!$A$7:$E$888,5,FALSE)","v":123.4},true,null,null,null,null,null,null,null,30014000,4010312313695]
[113,"FTS14KS FTS14-Kommunikationsschnittstelle",{"$f":"IF(AND(Eingabemaske!E4=\"nein\")*OR(Eingabemaske!E10>0,Eingabemaske!E11>0,Eingabemaske!E12>0,Eingabemaske!E13,Eingabemaske!E15,Eingabemaske!E16>0,Eingabemaske!E17>0,Eingabemaske!E19>0,Eingabemaske!E84>0),1,0)","v":0},0,{"$f":"D16*2","v":0},91.5,0,null,null,null,"","",{"$f":"L16*2","v":{"$error":"#VALUE!"}},null,{"$f":"VLOOKUP(AB16,Gesamtpreisliste!$A$7:$E$888,2,FALSE)","v":30014065},true,{"$f":"VLOOKUP(AB16,Gesamtpreisliste!$A$7:$E$888,3,FALSE)","v":"FTS14KS"},{"$f":"VLOOKUP(AB16,Gesamtpreisliste!$A$7:$E$888,5,FALSE)","v":91.5},true,null,null,null,null,null,null,null,30014065,4010312315651]
[114,"FA250 Funkantenne mit 2,5 Meter Koax-Kabel",{"$f":"IF(AND(Eingabemaske!E83=\"ja\",Eingabemaske!E85=\"ja\",C15>0),1,0)","v":0},0,null,31.7,0,null,null,null,"","",null,null,{"$f":"VLOOKUP(AB17,Gesamtpreisliste!$A$7:$E$888,2,FALSE)","v":30000550},true,{"$f":"VLOOKUP(AB17,Gesamtpreisliste!$A$7:$E$888,3,FALSE)","v":"FA250"},{"$f":"VLOOKUP(AB17,Gesamtpreisliste!$A$7:$E$888,5,FALSE)","v":31.7},true,null,null,null,null,null,null,null,30000550,4010312300244]
[115,"FHM175 HF-Masse für FA250",{"$f":"IF(AND(Eingabemaske!E83=\"ja\",Eingabemaske!E86=\"ja\",C15>0),1,0)","v":0},0,null,91.8,0,null,null,null,"","",null,null,{"$f":"VLOOKUP(AB18,Gesamtpreisliste!$A$7:$E$888,2,FALSE)","v":30000555},true,{"$f":"VLOOKUP(AB18,Gesamtpreisliste!$A$7:$E$888,3,FALSE)","v":"FHM175"},{"$f":"VLOOKUP(AB18,Gesamtpreisliste!$A$7:$E$888,5,FALSE)","v":91.8},true,null,null,null,null,null,null,null,30000555,4010312313121]
[116,"FEM Funk-Empfangsmodul für Sub-Bus (Zusatzantenne)",{"$f":"IF(AND(Eingabemaske!E83=\"ja\",Eingabemaske!E87>0),Eingabemaske!E87,0)","v":0},0,null,95.4,0,null,null,null,"","",null,null,{"$f":"VLOOKUP(AB19,Gesamtpreisliste!$A$7:$E$888,2,FALSE)","v":30014016},true,{"$f":"VLOOKUP(AB19,Gesamtpreisliste!$A$7:$E$888,3,FALSE)","v":"FEM"},{"$f":"VLOOKUP(AB19,Gesamtpreisliste!$A$7:$E$888,5,FALSE)","v":95.4},true,null,null,null,null,null,null,null,30014016,4010312313848]
[117,"FTS14EM Taster-Eingabemodul",{"$f":"IF(AND(Eingabemaske!E34=\"Ja\",Eingabemaske!E56=\"ja\",Eingabemaske!E64=\"ja\"),ROUNDUP((Eingabemaske!E36+Eingabemaske!E37+Eingabemaske!E38+C52*2+C53+C54)/10,0)+ROUNDUP(Eingabemaske!E57/10,0)+ROUNDUP(Eingabemaske!E65/10,0),IF(AND(Eingabemaske!E34=\"Ja\",NOT(Eingabemaske!E56=\"ja\"),NOT(Eingabemaske!E64=\"ja\")),ROUNDUP((Eingabemaske!E36+Eingabemaske!E37+Eingabemaske!E38+C52*2+C53+C54)/10,0),IF(AND(NOT(Eingabemaske!E34=\"Ja\"),Eingabemaske!E56=\"ja\",NOT(Eingabemaske!E64=\"ja\")),ROUNDUP(Eingabemaske!E57/10,0),IF(AND(NOT(Eingabemaske!E34=\"Ja\"),NOT(Eingabemaske!E56=\"ja\"),Eingabemaske!E64=\"ja\"),ROUNDUP(Eingabemaske!E65/10,0),IF(AND(Eingabemaske!E34=\"Ja\",Eingabemaske!E56=\"ja\",NOT(Eingabemaske!E64=\"ja\")),ROUNDUP((Eingabemaske!E36+Eingabemaske!E37+Eingabemaske!E38+C52*2+C53+C54)/10,0)+ROUNDUP(Eingabemaske!E57/10,0),IF(AND(Eingabemaske!E34=\"Ja\",NOT(Eingabemaske!E56=\"ja\"),Eingabemaske!E64=\"ja\"),ROUNDUP((Eingabemaske!E36+Eingabemaske!E37+Eingabemaske!E38+C52*2+C53+C54)/10,0)+ROUNDUP(Eingabemaske!E65/10,0),IF(AND(NOT(Eingabemaske!E34=\"Ja\"),Eingabemaske!E56=\"ja\",Eingabemaske!E64=\"ja\"),(ROUNDUP(Eingabemaske!E57/10,0)+ROUNDUP(Eingabemaske!E65/10,0)),0)))))))","v":0},0,{"$f":"D20*2","v":0},68.900000000000006,0,null,0.13,0,"","",{"$f":"L20*2","v":{"$error":"#VALUE!"}},null,{"$f":"VLOOKUP(AB20,Gesamtpreisliste!$A$7:$E$888,2,FALSE)","v":30014060},true,{"$f":"VLOOKUP(AB20,Gesamtpreisliste!$A$7:$E$888,3,FALSE)","v":"FTS14EM"},{"$f":"VLOOKUP(AB20,Gesamtpreisliste!$A$7:$E$888,5,FALSE)","v":68.900000000000006},true,null,null,null,null,null,null,null,30014060,4010312315071]
{"$rows_left_out":167}
{"sheet":"Kurzanleitung","index":2,"n_rows":3,"n_cols":1,"rows_kept":3,"cut":false,"hidden":false,"merged":[[2,0,2,1],[1,0,1,1]]}
["\n  Eltako Professional Smart Home\n  Kurzanleitung:"]
["Stellen Sie zunächst sicher, dass die Makros aktiviert sind. Klicken Sie hier für online Hilfe"]
["Bitte tragen Sie in der Spalte E alle gewünschten Funktionseigenschaften des Projektes ein.\nZur vereinfachten Eingabe stehen Ihnen bei Bedarf DropDown-Buttons zur Verfügung, aus der Sie die möglichen Angaben direkt auswählen können.\nAlle anderen Angaben (Zahlen) tragen Sie bitte per Hand ein.\nDie Kalkulationshilfe hilft Ihnen bei der Ermittlung aller Ansteuervarianten und Auswahl der Schaltaktoren:\n     1. FTS14-System (1+n Technik)\n     2. 2-Draht-Bus-System für Tasteransteuerung mit Tastergateways\n     3. 4-Draht-Bus-System für Sensoranschluss mit Busgateways\n     4. Funk-Taster oder Fernbedienung\nAuch die Kombination aller 4 Systeme ist möglich.\n\nDabei werden alle notwendigen Steuereingänge, Eingangsmodule, Busmodule oder Funktaster sowie\nalle notwendigen Systemgeräte, Spannungsversorgungen und Zubehörkomponenten ermittelt. \nNach Beendigung der Eingabe wird auf der zweiten Karteikarte eine Stückliste mit allen Mengen und Bruttowerten ausgegeben.\nEine manuelle Ergänzug der Stückliste ist jederzeit möglich. Ebenso ein Reset aller Mengen durch Klick auf \"Stückzahlen Reset\" in der Eingabemaske.\nZum Schluss den obere Button \"Stückliste aktualisieren\" betätigen.\nAuf der letzten Karteikarte lässt sich mit Klick auf \"Ausschreibung aktualisieren\" ein Leistungsverzeichnis erstellen. (Derzeit in Arbeit, vorübergehend nicht verfügbar) \nWICHTIG!\nNach evtl.  Änderung in der Eingabemaske muss auf \"Stückliste aktualisieren\" geklickt werden.\nNur so wird eine bereits gefilterte Liste nach Änderung der Eingabemaske neu aktualisiert. "]

{"sheet":"Gesamtpreisliste","index":3,"n_rows":888,"n_cols":10,"rows_kept":888,"cut":false,"hidden":false,"merged":[]}
["Eltako Preisliste 2024",null,null,"gültig für Lieferungen ab 01.01.2024"]
["Stand 05.05.2024"]
["Unverbindlich empfohlene Verkaufspreise und Netto-Einkaufspreise per Stück in Euro zzgl. MwSt."]
["Preis per Stück in Euro ohne MwSt."]
[]
["EAN","Artikel-Nr.","Bezeichnung","Kurzbeschreibung","Brutto"]
[4010312900987,20000010,"DS12","Distanzstück",2.1,null,"XR12-400-230V",62,22400930,4010312201374]
[4010312901243,20000030,"KM12","Hilfskontakt 1 Schließer + 1 Öffner, 4 A",17.100000000000001,null,"MSR12-UC",100.2,22500501,4010312205327]
[4010312909843,20000050,"EBOX","Eurobehälter mit Scharnierdeckel",15,null,"DS12",2.1,20000010,4010312900987]
[4010312901748,20000060,"WNT12-12VDC-12W/1A","Weitbereichs-Schaltnetzteil 12V DC",66.7,null,"XS12-400-230V",60.2,21400930,4010312101650]
[4010312901755,20000061,"WNT12-24VDC-12W/0,5A","Weitbereichs-Schaltnetzteil 24V DC",66.7,null,"RC12-230V",42,22000015,4010312201596]
[4010312300077,20000062,"WNT12-12VDC-24W/2A","Weitbereichs-Schaltnetzteil 12V DC",74.2,null,"AR12DX-230V",71.400000000000006,22001130,4010312205426]
[4010312300084,20000063,"WNT12-24VDC-24W/1A","Weitbereichs-Schaltnetzteil 24V DC",74.2,null,"NR12-001-3x230V",61.2,22001330,4010312202524]
[4010312300114,20000065,"WNT12-24VDC-48W/2A","Weitbereichs-Schaltnetzteil 24V DC",109.9,null,"BZR12DDX-UC",69.099999999999994,22001430,4010312603161]
[4010312401880,20000072,"WNT15-12VDC/24W","Weitbereichs-Schaltnetzteil 12V DC",52.5,null,"KM12",17.100000000000001,20000030,4010312901243]
[4010312401910,20000073,"WNT15-24VDC/24W","Weitbereichs-Schaltnetzteil 24V DC",52.5,null,"WNT12-12VDC-12W/1A",66.7,20000060,4010312901748]
[4010312401903,20000075,"WNT15-24VDC/48W","Weitbereichs-Schaltnetzteil 24V DC",61.8,null,"WNT12-24VDC-12W/0,5A",66.7,20000061,4010312901755]
[4010312901267,20000080,"LS Lichtsensor","Lichtsensor",34.200000000000003,null,"MFZ12DBT-UC",101.1,23001003,4010312603284]
[4010312901281,20000082,"WS Windsensor","Windsensor",79.7,null,"MFZ12DDX-UC",70.099999999999994,23001004,4010312603079]
[4010312901731,20000084,"MS Multisensor","Multisensor",309.2,null,"ER12-001-UC",55.7,22001601,4010312205365]
{"$rows_left_out":869}
{"sheet":"Ausschreibungstexte","index":4,"n_rows":178,"n_cols":4,"rows_kept":178,"cut":false,"hidden":true,"merged":[]}
[1]
[2]
[3]
[4]
[5,null,"Menge"]
[6,"Ausschreibung \"Eltako - Das System im Gebäude\" "]
[7]
[null,"SmartHome Zentrale MiniSafe mit App GFA4\nZentrale für eine gewerkeübergreifende Hausautomationslösung.\nVerbindet eine Vielzahl an Funksensoren und Funkaktoren. \nOptionaler Offlinebetrieb über eigenen Access-Point ohne Onlineverbindung. Verschlüsselte Kommunikation.\nSpannungsversorgung: 12V DC, 100V-240V AC, 50/60Hz; Funkprotokolle: EnOcean/868,3MHz, LAN: 1x Ethernet-RJ 45; \nFabrikat/ Typ: Eltako MiniSafe oder gleichwertig",{"$f":"Stückliste!D134","v":0},{"$f":"IF(C8>0,C8,\"\")","v":""}]
[]
[8,"wibutler pro-Home-Server mit App WPHS\nZentrale für eine gewerkeübergreifende Hausautomationslösung.\nVerbindet eine Vielzahl an Funksensoren und Funkaktoren. \nOptionaler Offlinebetrieb über eigenen Access-Point ohne Onlineverbindung. Verschlüsselte Kommunikation.\nSpannungsversorgung: 12V DC, 100V-240V AC, 50/60Hz; Funkprotokolle: EnOcean/868,3MHz, Z-Wave, ZigBee, WLAN, Bluetooth, Bluetooth Smart; LAN: 1x Ethernet-RJ 45; Festplatte: Integrierte 8GB SSD; Arbeitsspeicher: 1GB DDR3-RAM; Prozessor: 1GHz CPU ARMADA 370 ARM v7; Audio: integrierter Lautsprecher, 3,5mm Klinkenanschluss. \nAbmessungen (LxBxH): 11,7x11,7x4,1cm; Farbe: weiß.\nFabrikat/ Typ: Eltako WPHS oder gleichwertig",{"$f":"Stückliste!D135","v":0},""]
[9]
[10,"Funk-Antennenmodul FAM14\nFunk-Antennenmodul für den Eltako-RS485-Bus als Reiheneinbaugerät\nfür Montage auf Tragschiene DIN-EN 60715 TH35\n2 Teilungseinheiten = 36mm breit, 58mm tief\nMit integriertem Schaltnetzteil 12V DC/12 W. Bidirektional. Verschlüsselter Funk.\nStand-by-Verlust: 1 Watt\nVersorgungsspannung: 230V\nFabrikat/ Typ: Eltako FAM14 oder gleichwertig",{"$f":"Stückliste!D15","v":0},""]
[11]
[12,"Funk-Empfangsmodul FEM\nFunk-Empfangsmodul für den RS485 Sub-Bus\nMaße: LxBxH: 78x40x22mm\nBei Anschluss einer größeren Funkantenne FA250 in optimierter Position \nkann die Empfangsreichweite erhöht werden\nFabrikat/ Typ: Eltako FEM oder gleichwertig",{"$f":"Stückliste!D19","v":0},""]
[13]
[14,"RS485-Bus-Gateway FGW14\nMehrfach-Gateway. Bidirektional.\nReiheneinbaugerät für Montage auf Tragschiene DIN-EN 60715 TH35\n1 Teilungseinheiten = 18mm breit, 58mm tief\nZum Einkoppeln von bis zu drei FEM, zur Direktverbindung mit dem Rechner GFVS-Safe II, zur Verbindung mit den Bus-Komponenten der älteren Baureihe 12, einer RS232-Schnittstelle oder als Busverbinder von zwei RS485-Bussen der Baureihe 14\nStand-by-Verlust: 0,5 Watt\nFabrikat/ Typ: Eltako FGW14 oder gleichwertig",{"$f":"Stückliste!D9","v":0},""]
[15]
[16,"RS485-Bus-Gateway FGW14-USB\nGateway mit USB-A-Anschluss. Bidirektional.\nReiheneinbaugerät für Montage auf Tragschiene DIN-EN 60715 TH35\n1 Teilungseinheiten = 18mm breit, 58mm tief\nZum Anschluss eines PCs über eine USB-Schnittstelle, zum Einkoppeln von bis zu drei FEM oder als Busverbinder von zwei RS485-Bussen der Baureihe 14\nStand-by-Verlust: 0,3 Watt\nFabrikat/ Typ: Eltako FGW14-USB oder gleichwertig",{"$f":"Stückliste!D10","v":0},""]
[17]
[null,"RS485-Bus-Gateway BGW14\nRS485-Bus-Gateway. Bidirektional.\n1 Teilungseinheit = 18mm breit, 58mm tief.\nAnschluss an den Eltako-RS485-Bus. Querverdrahtung Bus und Stromversorgung mit Steckbrücke. Betrieb in Verbindung mit FAM14 oder FTS14KS.\nMit bis zu 8 BGW14 lassen sich Daten von bis zu 128 Sensoren in den RS485-Bus einspeisen.\nStand-by-Verlust: 0,3 Watt \nFabrikat/ Typ: Eltako BGW14 oder gleichwertig",{"$f":"Stückliste!D11","v":0},""]
{"$rows_left_out":159}
{"sheet":"Changelog","index":5,"n_rows":14,"n_cols":2,"rows_kept":14,"cut":false,"hidden":true,"merged":[]}
["Datum","Änderungen"]
["2022-08-19","Logikkorrektur am Ende der Stückliste, Artikel werden aus der Gesamtpreisliste verwendet"]
["2022-09-14","Minisafe2 REG und Netzteil eingefügt"]
["2022-11-09","FRGBW14, FSR14M-2x, FDG62 eingefügt"]
["2022-11-13","Integration neues Schalterprogramm mit 6 verschiedenen Farben"]
["2023-02-01","Änderungen Scheffler (Bilderintegration)"]
["2023-02-03","Fehler Mengenerfassung und TE-Berechnung FSB14 beseitigt"]
["2023-02-03","Abfrage alle Temperaturfühler und Sensoren überarbeitet"]
["2023-02-03","Preisliste 1.5.2023 aktualisiert"]
["2023-02-16","TE bei FSB14, Zeilen ausblenden Makro angepasst, Logik für SNT bei 1+n Technik"]
["2022-04-20","Fehler bei FSB14 falsche TE"]
["2024-02-01","SNT gegen WNT ersetzt"]
["2024-07-03","SNT12 gegen WNT15 getauscht, Onwall USB-C Varianten ersetzt"]
["2024-07-05","WMS Multisensor  geändert"]